{"text_format":"1","workbook":"xlsx","n_sheets":16,"sheets":["PHA Info","Data Collection Form","Data Validation","Project BS","Project IS","Program BS","Program IS","COCC BS","COCC IS","Elimination BS","Elimination IS","Other Proj BS","Other Proj IS","HCV BS","HCV IS","Sheet3"],"not_rendered":{"charts":0,"images":9,"macros":1,"external_links":0,"defined_names":4,"comments":0,"pivot_tables":0},"unopened":[],"bounds":{"document_bytes":16777216,"sheet_cells":100000,"rows_first":2000,"rows_last":500,"rows_between":2000,"halvings":0,"cell_chars":16384,"cell_head_chars":4096},"cells_cut":0,"cells_raw":0,"read":"whole","date_system":"1900"}

{"sheet":"PHA Info","index":0,"n_rows":24,"n_cols":3,"rows_kept":24,"cut":false,"hidden":false,"merged":[[2,1,2,3],[3,1,3,3]]}
[]
[]
[null,"Welcome to the FDS Submission Upload Tool"]
[null,"Note: Use of this tool applies to Unaudited submissions only"]
[]
[]
[]
[null,"*Select PHA Code","0"]
[null,"*Select # of Projects"]
[null,"*Select # of Programs","0"]
[]
[null,"PHA Code:  ","Select PHA Code"]
[null,"PHA Name:  ",{"$f":"IFERROR(VLOOKUP(C12,Sheet3!$A$3:$B$4271,2,FALSE),\"\")","v":""}]
[]
[null,"*Asset Management Type:  ","Select Asset Management Type"]
[null,"*Accounting Method","Select Accounting Method"]
[null,"*Submission Type:  ","Select Submission Type"]
[{"$f":"IFERROR(C18/1,1)","v":"1900-01-01"},"*Fiscal Year End:  ","Select Fiscal Year End"]
[]
[null,null,"*Denotes required information"]
{"$rows_left_out":5}
{"sheet":"Data Collection Form","index":1,"n_rows":62,"n_cols":3,"rows_kept":62,"cut":false,"hidden":false,"merged":[]}
["PHA",{"$f":"'PHA Info'!C12&\" \"&'PHA Info'!C13","v":"Select PHA Code "}]
["FDS Submission",{"$f":"TEXT('PHA Info'!C18,\"mm\")&\"/\"&TEXT('PHA Info'!C18,\"dd\")&\"/\"&TEXT('PHA Info'!C18,\"yyyy\")&\"  \"&'PHA Info'!C17","v":"Select Fiscal Year End/Select Fiscal Year End/Select Fiscal Year End  Select Submission Type"}]
["Financial Statement","Data Collection Form"]
["DCF Line Item","Description","Input"]
["G9000-010","Fiscal Year Ending Date",{"$f":"'PHA Info'!C18","v":"Select Fiscal Year End"}]
["G2000-021","Reporting Period Covered"]
["G2000-031","Reporting Period Covered - Months"]
["G9000-020","Employer Identification Number"]
["G2000-040","Multiple EIN Indicator"]
["G9000-030","Data Universal Numbering System (DUNS) Number"]
["G2000-050","Multiple DUNS Indicator"]
["G9100-011","Entity Name"]
["G9100-021","Entity Street Address Line 1"]
["G9100-031","Entity Street Address Line 2"]
["G9100-041","Entity City"]
["G9100-051","Entity State"]
["G9100-061","Entity Zip Code"]
["G9100-066","Entity Zip Code Extension"]
["G2100-011","Entity Contact First Name"]
["G2100-021","Entity Contact Middle Initial"]
{"$rows_left_out":43}
{"sheet":"Data Validation","index":2,"n_rows":3,"n_cols":1,"rows_kept":3,"cut":false,"hidden":false,"merged":[]}
["Data Validaiton Sheet"]
[]
["To Be Developed"]

{"sheet":"Project BS","index":3,"n_rows":174,"n_cols":4,"rows_kept":174,"cut":false,"hidden":false,"merged":[]}
["PHA",{"$f":"'PHA Info'!C12&\" \"&'PHA Info'!C13","v":"Select PHA Code "}]
["FDS Submission",{"$f":"TEXT('PHA Info'!C18,\"mm\")&\"/\"&TEXT('PHA Info'!C18,\"dd\")&\"/\"&TEXT('PHA Info'!C18,\"yyyy\")&\"  \"&'PHA Info'!C17","v":"Select Fiscal Year End/Select Fiscal Year End/Select Fiscal Year End  Select Submission Type"}]
["Financial Statement","Project Balance Sheet"]
["FDS Line Item","Description","Total"]
[111,"Cash - Unrestricted",{"$f":"SUM($D5:$DY5)","v":0}]
[112,"Cash - Restricted - Modernization and Development",0]
[113,"Cash - Other Restricted",0]
[114,"Cash - Tenant Security Deposits",0]
[115,"Cash - Restricted for Payment of Current Liabilities",0]
[100,"Total Cash",0,{"$f":"SUM(D5:D9)","v":0}]
[" "," "]
[121,"Accounts Receivable - PHA Projects",{"$f":"SUM($D12:$DY12)","v":0}]
["122-010","Operating Subsidy",0]
["122-020","Capital Fund",0]
["122-030","Other",0]
[122," Accounts Receivable - HUD Other Projects",0,{"$f":"D15+D14+D13","v":0}]
[124,"Accounts Receivable - Other Government",0]
["125-010","Not For Profit",0]
["125-020","Partnership",0]
["125-030","Joint Venture",0]
{"$rows_left_out":155}
{"sheet":"Project IS","index":4,"n_rows":180,"n_cols":5,"rows_kept":180,"cut":false,"hidden":false,"merged":[]}
["PHA",{"$f":"'PHA Info'!C12&\" \"&'PHA Info'!C13","v":"Select PHA Code "},null,1,1]
["FDS Submission",{"$f":"TEXT('PHA Info'!C18,\"mm\")&\"/\"&TEXT('PHA Info'!C18,\"dd\")&\"/\"&TEXT('PHA Info'!C18,\"yyyy\")&\"  \"&'PHA Info'!C17","v":"Select Fiscal Year End/Select Fiscal Year End/Select Fiscal Year End  Select Submission Type"}]
["Financial Statement","Project Income Statement"]
["FDS Line Item","Description","Total",{"$f":"INDIRECT(\"'Project BS'!\"&VLOOKUP(D1,Sheet3!$K$3:$M$202,3,0)&\"4\")","v":0},{"$f":"INDIRECT(\"'Project BS'!\"&VLOOKUP(E1,Sheet3!$K$3:$M$202,3,0)&\"4\")","v":0}]
[null,null,null,"14.850",14.872]
[70300,"Net Tenant Rental Revenue",{"$f":"SUM($D6:$EH6)","v":0}]
[70400,"Tenant Revenue - Other",{"$f":"SUM($D7:$EH7)","v":0}]
[70500,"Total Tenant Revenue",{"$f":"SUM($D8:$EH8)","v":0},{"$f":"D7+D6","v":0},{"$f":"E7+E6","v":0}]
[" "," "]
[70600,"HUD PHA Operating Grants",{"$f":"SUM($D10:$EH10)","v":0}]
[70610,"Capital Grants",0]
[70710,"Management Fee",0]
[70720,"Asset Management Fee",0]
[70730," Book Keeping Fee",0]
[70740,"Front Line Service Fee",0]
[70750,"Other Fees",0]
[70700,"Total Fee Revenue",0,{"$f":"SUM(D12:D16)","v":0},{"$f":"SUM(E12:E16)","v":0}]
[" "," "]
[70800,"Other Government Grants",{"$f":"SUM($D19:$EH19)","v":0}]
[71100,"Investment Income - Unrestricted",0]
{"$rows_left_out":161}
{"sheet":"Program BS","index":5,"n_rows":118,"n_cols":4,"rows_kept":118,"cut":false,"hidden":false,"merged":[]}
["PHA",{"$f":"'PHA Info'!C12&\" \"&'PHA Info'!C13","v":"Select PHA Code "}]
["FDS Submission",{"$f":"TEXT('PHA Info'!C18,\"mm\")&\"/\"&TEXT('PHA Info'!C18,\"dd\")&\"/\"&TEXT('PHA Info'!C18,\"yyyy\")&\"  \"&'PHA Info'!C17","v":"Select Fiscal Year End/Select Fiscal Year End/Select Fiscal Year End  Select Submission Type"}]
["Financial Statement","Program Balance Sheet"]
["FDS Line Item","Description","Total"]
[111,"Cash - Unrestricted",{"$f":"SUM($D5:$IV5)","v":0}]
[112,"Cash - Restricted - Modernization and Development",0]
[113,"Cash - Other Restricted",0]
[114,"Cash - Tenant Security Deposits",0]
[115,"Cash - Restricted for Payment of Current Liabilities",0]
[100,"Total Cash",0,{"$f":"SUM(D5:D9)","v":0}]
[" "," "]
[121,"Accounts Receivable - PHA Projects",{"$f":"SUM($D12:$IV12)","v":0}]
[122," Accounts Receivable - HUD Other Projects",0]
[124,"Accounts Receivable - Other Government",0]
[125,"Accounts Receivable - Miscellaneous",0]
[126,"Accounts Receivable - Tenants",0]
[126.1,"Allowance for Doubtful Accounts -Tenants",0]
[126.2,"Allowance for Doubtful Accounts - Other",0]
[127,"Notes, Loans, & Mortgages Receivable - Current",0]
[128,"Fraud Recovery",0]
{"$rows_left_out":99}
{"sheet":"Program IS","index":6,"n_rows":157,"n_cols":4,"rows_kept":157,"cut":false,"hidden":false,"merged":[]}
["PHA",{"$f":"'PHA Info'!C12&\" \"&'PHA Info'!C13","v":"Select PHA Code "},null,0]
["FDS Submission",{"$f":"TEXT('PHA Info'!C18,\"mm\")&\"/\"&TEXT('PHA Info'!C18,\"dd\")&\"/\"&TEXT('PHA Info'!C18,\"yyyy\")&\"  \"&'PHA Info'!C17","v":"Select Fiscal Year End/Select Fiscal Year End/Select Fiscal Year End  Select Submission Type"}]
["Financial Statement","Program Income Statement"]
["FDS Line Item","Description","Total",{"$f":"IFERROR(INDIRECT(\"'Program BS'!\"&VLOOKUP(D1,Sheet3!$K$3:$M$202,3,0)&\"4\"),\"\")","v":""}]
[70300,"Net Tenant Rental Revenue",{"$f":"SUM($D5:$IV5)","v":0}]
[70400,"Tenant Revenue - Other",0]
[70500,"Total Tenant Revenue",0,{"$f":"SUM(D5:D6)","v":0}]
[" "," ",0]
[70600,"HUD PHA Operating Grants",0]
[70610,"Capital Grants",0]
[70710,"Management Fee",0]
[70720,"Asset Management Fee",0]
[70730," Book Keeping Fee",0]
[70740,"Front Line Service Fee",0]
[70750,"Other Fees",0]
[70700,"Total Fee Revenue",0,{"$f":"SUM(D11:D15)","v":0}]
[" "," "]
[70800,"Other Government Grants",{"$f":"SUM($D18:$IV18)","v":0}]
[71100,"Investment Income - Unrestricted",0]
[71200,"Mortgage Interest Income",0]
{"$rows_left_out":138}
{"sheet":"COCC BS","index":7,"n_rows":173,"n_cols":3,"rows_kept":173,"cut":false,"hidden":false,"merged":[]}
["PHA",{"$f":"'PHA Info'!C12&\" \"&'PHA Info'!C13","v":"Select PHA Code "}]
["FDS Submission",{"$f":"TEXT('PHA Info'!C18,\"mm\")&\"/\"&TEXT('PHA Info'!C18,\"dd\")&\"/\"&TEXT('PHA Info'!C18,\"yyyy\")&\"  \"&'PHA Info'!C17","v":"Select Fiscal Year End/Select Fiscal Year End/Select Fiscal Year End  Select Submission Type"}]
["Financial Statement","COCC Balance Sheet"]
["FDS Line Item","Description","Amount"]
[111,"Cash - Unrestricted"]
[112,"Cash - Restricted - Modernization and Development"]
[113,"Cash - Other Restricted"]
[114,"Cash - Tenant Security Deposits"]
[115,"Cash - Restricted for Payment of Current Liabilities"]
[100,"Total Cash",{"$f":"SUM(C5:C9)","v":0}]
[" "," "]
[121,"Accounts Receivable - PHA Projects"]
["122-010","Operating Subsidy"]
["122-020","Capital Fund"]
["122-030","Other"]
[122," Accounts Receivable - HUD Other Projects",{"$f":"SUM(C13:C15)","v":0}]
[124,"Accounts Receivable - Other Government"]
["125-010","Not For Profit"]
["125-020","Partnership"]
["125-030","Joint Venture"]
{"$rows_left_out":154}
{"sheet":"COCC IS","index":8,"n_rows":174,"n_cols":5,"rows_kept":174,"cut":false,"hidden":false,"merged":[]}
["PHA",{"$f":"'PHA Info'!C12&\" \"&'PHA Info'!C13","v":"Select PHA Code "}]
["FDS Submission",{"$f":"TEXT('PHA Info'!C18,\"mm\")&\"/\"&TEXT('PHA Info'!C18,\"dd\")&\"/\"&TEXT('PHA Info'!C18,\"yyyy\")&\"  \"&'PHA Info'!C17","v":"Select Fiscal Year End/Select Fiscal Year End/Select Fiscal Year End  Select Submission Type"}]
["Financial Statement","COCC Income Statement"]
["FDS Line Item","Description","Total","14.850",14.872]
[70300,"Net Tenant Rental Revenue",{"$f":"SUM($D5:$E5)","v":0}]
[70400,"Tenant Revenue - Other",{"$f":"SUM($D6:$E6)","v":0}]
[70500,"Total Tenant Revenue",{"$f":"SUM($D7:$E7)","v":0},{"$f":"+D5+D6","v":0},{"$f":"+E5+E6","v":0}]
[" "," "]
[70600,"HUD PHA Operating Grants",{"$f":"SUM($D9:$E9)","v":0}]
[70610,"Capital Grants",0,0,0]
[70710,"Management Fee",0]
[70720,"Asset Management Fee",0]
[70730," Book Keeping Fee",0]
[70740,"Front Line Service Fee",0]
["70750-010","From PHA Administered Program",0]
["70750-020","From Third/Outside Party",0]
[70750,"Other Fees",0,{"$f":"SUM(D15:D16)","v":0},{"$f":"SUM(E15:E16)","v":0}]
[70750,"Other Fees",0]
[70700,"Total Fee Revenue",0,{"$f":"SUM(D11:D14,D17,D18)","v":0},{"$f":"SUM(E11:E14,E17,E18)","v":0}]
[" "," "]
{"$rows_left_out":155}
{"sheet":"Elimination BS","index":9,"n_rows":115,"n_cols":3,"rows_kept":115,"cut":false,"hidden":false,"merged":[]}
["PHA",{"$f":"'PHA Info'!C12&\" \"&'PHA Info'!C13","v":"Select PHA Code "}]
["FDS Submission",{"$f":"TEXT('PHA Info'!C18,\"mm\")&\"/\"&TEXT('PHA Info'!C18,\"dd\")&\"/\"&TEXT('PHA Info'!C18,\"yyyy\")&\"  \"&'PHA Info'!C17","v":"Select Fiscal Year End/Select Fiscal Year End/Select Fiscal Year End  Select Submission Type"}]
["Financial Statement","Elimination Balance Sheet"]
["FDS Line Item","Description","Amount"]
[111,"Cash - Unrestricted"]
[112,"Cash - Restricted - Modernization and Development"]
[113,"Cash - Other Restricted"]
[114,"Cash - Tenant Security Deposits"]
[115,"Cash - Restricted for Payment of Current Liabilities"]
[100,"Total Cash",{"$f":"SUM(C5:C9)","v":0}]
[" "," "]
[121,"Accounts Receivable - PHA Projects"]
[122," Accounts Receivable - HUD Other Projects"]
[124,"Accounts Receivable - Other Government"]
[125,"Accounts Receivable - Miscellaneous"]
[126,"Accounts Receivable - Tenants"]
[126.1,"Allowance for Doubtful Accounts -Tenants"]
[126.2,"Allowance for Doubtful Accounts - Other"]
[127,"Notes, Loans, & Mortgages Receivable - Current"]
[128,"Fraud Recovery"]
{"$rows_left_out":96}
{"sheet":"Elimination IS","index":10,"n_rows":143,"n_cols":3,"rows_kept":143,"cut":false,"hidden":false,"merged":[]}
["PHA",{"$f":"'PHA Info'!C12&\" \"&'PHA Info'!C13","v":"Select PHA Code "}]
["FDS Submission",{"$f":"TEXT('PHA Info'!C18,\"mm\")&\"/\"&TEXT('PHA Info'!C18,\"dd\")&\"/\"&TEXT('PHA Info'!C18,\"yyyy\")&\"  \"&'PHA Info'!C17","v":"Select Fiscal Year End/Select Fiscal Year End/Select Fiscal Year End  Select Submission Type"}]
["Financial Statement","Elimination Income Statement"]
["FDS Line Item","Description","Amount"]
[70300,"Net Tenant Rental Revenue"]
[70400,"Tenant Revenue - Other"]
[70500,"Total Tenant Revenue",{"$f":"SUM(C5:C6)","v":0}]
[" "," "]
[70600,"HUD PHA Operating Grants"]
[70610,"Capital Grants"]
[70710,"Management Fee"]
[70720,"Asset Management Fee"]
[70730," Book Keeping Fee"]
[70740,"Front Line Service Fee"]
[70750,"Other Fees"]
[70700,"Total Fee Revenue",{"$f":"SUM(C11:C15)","v":0}]
[" "," "]
[70800,"Other Government Grants"]
[71100,"Investment Income - Unrestricted"]
[71200,"Mortgage Interest Income"]
{"$rows_left_out":124}
{"sheet":"Other Proj BS","index":11,"n_rows":118,"n_cols":3,"rows_kept":118,"cut":false,"hidden":false,"merged":[]}
["PHA",{"$f":"'PHA Info'!C12&\" \"&'PHA Info'!C13","v":"Select PHA Code "}]
["FDS Submission",{"$f":"TEXT('PHA Info'!C18,\"mm\")&\"/\"&TEXT('PHA Info'!C18,\"dd\")&\"/\"&TEXT('PHA Info'!C18,\"yyyy\")&\"  \"&'PHA Info'!C17","v":"Select Fiscal Year End/Select Fiscal Year End/Select Fiscal Year End  Select Submission Type"}]
["Financial Statement","Other Project Balance Sheet"]
["FDS Line Item","Description","Amount"]
[111,"Cash - Unrestricted"]
[112,"Cash - Restricted - Modernization and Development"]
[113,"Cash - Other Restricted"]
[114,"Cash - Tenant Security Deposits"]
[115,"Cash - Restricted for Payment of Current Liabilities"]
[100,"Total Cash",{"$f":"SUM(C5:C9)","v":0}]
[" "," "]
[121,"Accounts Receivable - PHA Projects"]
[122," Accounts Receivable - HUD Other Projects"]
[124,"Accounts Receivable - Other Government"]
[125,"Accounts Receivable - Miscellaneous"]
[126,"Accounts Receivable - Tenants"]
[126.1,"Allowance for Doubtful Accounts -Tenants"]
[126.2,"Allowance for Doubtful Accounts - Other"]
[127,"Notes, Loans, & Mortgages Receivable - Current"]
[128,"Fraud Recovery"]
{"$rows_left_out":99}
{"sheet":"Other Proj IS","index":12,"n_rows":169,"n_cols":5,"rows_kept":169,"cut":false,"hidden":false,"merged":[]}
["PHA",{"$f":"'PHA Info'!C12&\" \"&'PHA Info'!C13","v":"Select PHA Code "}]
["FDS Submission",{"$f":"TEXT('PHA Info'!C18,\"mm\")&\"/\"&TEXT('PHA Info'!C18,\"dd\")&\"/\"&TEXT('PHA Info'!C18,\"yyyy\")&\"  \"&'PHA Info'!C17","v":"Select Fiscal Year End/Select Fiscal Year End/Select Fiscal Year End  Select Submission Type"}]
["Financial Statement","Other Project Income Statement"]
["FDS Line Item","Description","Total","14.850","14.872"]
[70300,"Net Tenant Rental Revenue",{"$f":"SUM($D5:$E5)","v":0}]
[70400,"Tenant Revenue - Other",{"$f":"SUM($D6:$E6)","v":0}]
[70500,"Total Tenant Revenue",{"$f":"SUM($D7:$E7)","v":0},{"$f":"SUM(D5:D6)","v":0},{"$f":"SUM(E5:E6)","v":0}]
[" "," "]
[70600,"HUD PHA Operating Grants",{"$f":"SUM($D9:$E9)","v":0}]
[70610,"Capital Grants",0]
[70710,"Management Fee",0]
[70720,"Asset Management Fee",0]
[70730," Book Keeping Fee",0]
[70740,"Front Line Service Fee",0]
[70750,"Other Fees",0]
[70700,"Total Fee Revenue",0,{"$f":"SUM(D11:D15)","v":0},{"$f":"SUM(E11:E15)","v":0}]
[" "," "]
[70800,"Other Government Grants",{"$f":"SUM($D18:$E18)","v":0}]
[71100,"Investment Income - Unrestricted",0]
[71200,"Mortgage Interest Income",0]
{"$rows_left_out":150}
{"sheet":"HCV BS","index":13,"n_rows":134,"n_cols":3,"rows_kept":134,"cut":false,"hidden":false,"merged":[]}
["PHA",{"$f":"'PHA Info'!C12&\" \"&'PHA Info'!C13","v":"Select PHA Code "}]
["FDS Submission",{"$f":"TEXT('PHA Info'!C18,\"mm\")&\"/\"&TEXT('PHA Info'!C18,\"dd\")&\"/\"&TEXT('PHA Info'!C18,\"yyyy\")&\"  \"&'PHA Info'!C17","v":"Select Fiscal Year End/Select Fiscal Year End/Select Fiscal Year End  Select Submission Type"}]
["Financial Statement","HCV Program Balance Sheet"]
["FDS Line Item","Description",14.871]
[111,"Cash - Unrestricted"]
[112,"Cash - Restricted - Modernization and Development"]
["113-010","HAP Funds"]
["113-020","FSS Escrow Deposits"]
["113-030","All Other Funds"]
[113,"Cash - Other Restricted",{"$f":"SUM(C7:C9)","v":0}]
[113,"Cash - Other Restricted"]
[114,"Cash - Tenant Security Deposits"]
["115-010","HAP Funds"]
["115-020","FSS Escrow Deposits"]
["115-030","All Other Funds"]
[115,"Cash - Restricted for Payment of Current Liabilities",{"$f":"SUM(C13:C15)","v":0}]
[115,"Cash - Restricted for Payment of Current Liabilities"]
[100,"Total Cash",{"$f":"SUM(C5:C6,C10,C11,C12,C17,C16)","v":0}]
[" "," "]
[121,"Accounts Receivable - PHA Projects"]
{"$rows_left_out":115}
{"sheet":"HCV IS","index":14,"n_rows":220,"n_cols":3,"rows_kept":220,"cut":false,"hidden":false,"merged":[]}
["PHA",{"$f":"'PHA Info'!C12&\" \"&'PHA Info'!C13","v":"Select PHA Code "}]
["FDS Submission",{"$f":"TEXT('PHA Info'!C18,\"mm\")&\"/\"&TEXT('PHA Info'!C18,\"dd\")&\"/\"&TEXT('PHA Info'!C18,\"yyyy\")&\"  \"&'PHA Info'!C17","v":"Select Fiscal Year End/Select Fiscal Year End/Select Fiscal Year End  Select Submission Type"}]
["Financial Statement","HCV Program Income Statement"]
["FDS Line Item","Description","14.871"]
[70300,"Net Tenant Rental Revenue"]
[70400,"Tenant Revenue - Other"]
[70500,"Total Tenant Revenue",{"$f":"+C5+C6","v":0}]
[" "," "]
["70600-010","Housing Assistance Payments"]
["70600-020","Ongoing Administrative Fees Earned"]
["70600-030","Hard to House Fee Revenue"]
["70600-031","FSS Coordinator Grant"]
["70600-040","Actual Independent Public Accountant Audit Costs"]
["70600-050","Total Preliminary Fees Earned"]
["70600-060","All Other Fees"]
["70600-070","Admin Fee Calculation Description"]
[70600,"HUD PHA Operating Grants",{"$f":"SUM(C9:C15)","v":0}]
[70610,"Capital Grants"]
[]
[70710,"Management Fee"]
{"$rows_left_out":201}
{"sheet":"Sheet3","index":15,"n_rows":4271,"n_cols":13,"rows_kept":4271,"cut":false,"hidden":true,"merged":[]}
["PHA","PHA Name"]
["Select PHA Code",null,null,null,"Select Submission Type",null,null,"Select Accounting Method",null,null,0,0]
["AK001","Alaska Housing Finance Corporation",null,null,"Unaudited/Non Single Audit",null,null,"Full Accrual",null,null,1,1,"D"]
["AK901","AK HSG FINANCE CORP",null,null,"Unaudited/No Audit ",null,null,"Modified Accrual",null,null,2,2,"E"]
["AL001","Housing Authority of the Birmingham District",null,null,"Unaudited/Single Audit",null,null,null,null,null,3,3,"F"]
["AL002","Mobile Housing Board",null,null," ",null,null,null,null,null,4,4,"G"]
["AL004","Anniston HA",null,null,"Select Asset Management Type",null,null,null,null,null,5,5,"H"]
["AL005","Phenix City Housing Authority",null,null,"Asset Management without COCC/Elimination ",null,null,null,null,null,6,6,"I"]
["AL006","Housing Authority of the City of Montgomery",null,null,"Asset Management with Elimination Only ",null,null,null,null,null,7,7,"J"]
["AL007","Housing Authority of the City of Dothan",null,null,"Asset Management with COCC/Elimination ",null,null,null,null,null,8,8,"K"]
["AL008","Selma Housing Authority",null,null,"Non-Asset Management with COCC/Elimination ",null,null,null,null,null,9,9,"L"]
["AL009","Housing Authority of the City of Attalla",null,null,"Non-Asset Management with Elimination Only ",null,null,null,null,null,10,10,"M"]
["AL010","Fairfield Housing Authority",null,null,"Non Asset Management",null,null,null,null,null,11,11,"N"]
["AL011","Housing Authority of the City of Fort Payne",null,null,null,null,null,null,null,null,12,12,"O"]
["AL012","Housing Authority of the City of Jasper",null,null,null,null,null,null,null,null,13,13,"P"]
["AL013","Tarrant Housing Authority",null,null,null,null,null,null,null,null,14,14,"Q"]
["AL014","The Guntersville Housing Authority",null,null," ",null,null,null,null,null,15,15,"R"]
["AL047","The Housing Authority of the City of Huntsville",null,null,"Select Fiscal Year End",null,null,null,null,null,16,16,"S"]
["AL048","Housing Authority of the City of Decatur",null,null,"12/31/2015",null,null,null,null,null,17,17,"T"]
["AL049","Greater Gadsden",null,null,"3/31/2016",null,null,null,null,null,18,18,"U"]
{"$rows_left_out":4251}